If you have an error - if no-one else can help - then maybe you should - paste it in here

We of course, advise all people to read the fucking manual of any software that they are trying to install. However, there are times when that manual is so big, or so complicated, or so non-existent, or the software so rare/new, that it can't be done.
RSS feed

Paste your error message in here to search or add:

Last errors

Errors reported in : Previous 2020 07 Next
Key: Answers, People Waiting

ID Category Error message
6251 google_authenticator pam_succeed_if(sshd:auth): requirement "uid >= 1000" not met by user "root"
6250 1 [SOLVED] Unsatisfied dependency expressed through method 'methodValidationPostProcessor' parameter 0;
6249 1 [SOLVED] Handler dispatch failed; nested exception is java.lang.NoSuchMethodError:
6248 CentOS 7 Failed to issue method call: Invalid Locale data.
6247 onos 1 [SOLVED] io.netty.handler.codec.DecoderException: org.projectfloodlight.openflow.exceptions.OFParseError: Wrong length: Expected=40(40), got=32
6246 OVS 1 [SOLVED] fail_open|WARN|Could not connect to controller (or switch failed controller's post-connection admission control policy) for 15 seconds, failing open
6245 ovs 1 [SOLVED] ovs-vsctl: unix:/usr/local/var/run/openvswitch/db.sock: database connection failed (No such file or directory)
6244 1 [SOLVED] error: possibly undefined macro: LT_INIT
6243 JavaFX java.lang.module.FindException: Module javafx.base not found
6242 JavaFX Unrecognized option: --module-path
6241 JavaFX 1 Caused by: java.lang.IllegalAccessError: superclass access check failed: class com.sun.javafx.scene.control.ControlHelper (in unnamed module @0x25359ed8) cannot access class com.sun.javafx.scene.layout.RegionHelper (in module because module does not export com.sun.javafx.scene.layout to unnamed module @0x25359ed8
6240 java 1 org.springframework.context.ApplicationContextException: Failed to start bean 'outputBindingLifecycle'; nested exception is java.lang.IllegalArgumentException: A default binder has been requested, but there is no binder available
6239 Java java.lang.IllegalStateException: No primary or default constructor found for class
6237 Firefox 1 [SOLVED] Software is Preventing Firefox From Safely Connecting to This Site
6236 RestTemplate org.springframework.web.client.RestClientException: No HttpMessageConverter for
6235 1 1 [SOLVED] java.awt.AWTError: Assistive Technology not found: org.GNOME.Accessibility.AtkWrapper
6234 Exception evaluating SpringEL expression: "principal.authorities"
6233 Spring Boot Error retrieving value for property "principal.authorities" of authentication object of class
6232 java.lang.NoClassDefFoundError: Could not initialize class org.springframework.test.context.junit4.SpringRunner
6231 testcontainers 1 [SOLVED] java.lang.IllegalStateException: Check failed: Docker environment should have more than 2GB free disk space
6230 JFreeChart 1 [SOLVED] Could not initialize class org.jfree.chart.JFreeChart
6229 org.reflections 1 [SOLVED] org.reflections.ReflectionsException: Scanner SubTypesScanner was not configured
6228 Git 1 [SOLVED] schannel: next InitializeSecurityContext failed: Unknown error (0x80092012) - The revocation function was unable to check revocation for the certificate.
6227 Sybase 1 [SOLVED] No login with the specified name exists.
6226 Android SDK 1 [SOLVED] bash: android-sdk-linux/tools/emulator: No such file or directory
6225 iwlwifi 1 [SOLVED] iwlwifi 0000:00:06.0 wls6f0: disabling VHT as WMM/QoS is not supported by the AP
6224 iwlwifi 1 [SOLVED] iwlwifi 0000:00:06.0 wls6f0: disabling HT as WMM/QoS is not supported by the AP
6223 Spring Boot /login 1 [SOLVED] Request method 'POST' not supported
6222 I/O error while reading input message; nested exception is Early EOF
6221 Groovy 1 [SOLVED] Cannot resolve which method to invoke for [null, class] due to overlapping prototypes between:

Psst - want to help build a list of common error messages?
Put the following line in your /etc/[r]syslog.conf file:


Collecting solutions to error messages since Aug 2005. © rtfm 2005-2020